{"text_format":"1","workbook":"xlsx","n_sheets":4,"sheets":["PENZTAR_ADAT","BC_CSV","9_OSZLOPOS","Beallitasok"],"not_rendered":{"charts":0,"images":0,"macros":1,"external_links":0,"defined_names":0,"comments":0,"pivot_tables":0},"unopened":[],"bounds":{"document_bytes":16777216,"sheet_cells":100000,"rows_first":2000,"rows_last":500,"rows_between":2000,"halvings":0,"cell_chars":16384,"cell_head_chars":4096},"cells_cut":0,"cells_raw":0,"read":"whole","date_system":"1900"}

{"sheet":"PENZTAR_ADAT","index":0,"n_rows":69,"n_cols":18,"rows_kept":69,"cut":false,"hidden":false,"merged":[[0,0,0,4],[0,7,0,10],[0,5,0,6]]}
["KORALLSZIRT",null,null,null,null,2021,null,"Január"]
[]
["Összesítés:",null,{"$f":"SUM(C6:C67)","v":99200},198400,297600,396800,0,0,0,0,49600,54560,59520,64480,-4,763840,992000]
[null,null,null,null,null,null,null,null,null,null,null,null,null,null,null,null,null,"NYITÓ"]
["DÁTUM (NAP!)","BIZONY-LAT ",0.27,0.05,0.18,0.27,{"$f":"Beallitasok!$B$12&\" \"&C5*100&\"%\"","v":"Téves beütés 27%"},{"$f":"Beallitasok!$B$12&\" \"&D5*100&\"%\"","v":"Téves beütés 5%"},{"$f":"Beallitasok!$B$12&\" \"&E5*100&\"%\"","v":"Téves beütés 18%"},{"$f":"Beallitasok!$B$12&\" \"&F5*100&\"%\"","v":"Téves beütés 27%"},"BANKKÁRTYA","Netpincér","MKB SZÉP KÁRTYA","Szép","Kerekítés","KP","NAPI ÖSSZESEN",50000]
[1,1,100,200,300,400,null,null,null,null,50,55,60,65,-2,{"$f":"Q6-SUM(K6:N6)","v":770},{"$f":"SUM(C6:F6)-SUM(G6:J6)","v":1000},{"$f":"R5+Q6","v":51000}]
[{"$f":"A6+1","v":2},{"$f":"B6+1","v":2},{"$f":"$B7*C$6","v":200},{"$f":"$B7*D$6","v":400},600,800,null,null,null,null,{"$f":"$B7*K$6","v":100},110,120,130,null,{"$f":"Q7-SUM(K7:N7)","v":1540},{"$f":"SUM(C7:F7)-SUM(G7:J7)","v":2000},53000]
[{"$f":"A7+1","v":3},3,{"$f":"$B8*C$6","v":300},600,900,1200,null,null,null,null,150,165,180,195,null,2310,3000,56000]
[4,4,400,800,1200,1600,null,null,null,null,200,220,240,260,null,3080,4000,60000]
[5,5,500,1000,1500,2000,null,null,null,null,250,275,300,325,null,3850,5000,65000]
[6,6,600,1200,1800,2400,null,null,null,null,300,330,360,390,null,4620,6000,71000]
[7,7,700,1400,2100,2800,null,null,null,null,350,385,420,455,null,5390,7000,78000]
[8,8,800,1600,2400,3200,null,null,null,null,400,440,480,520,null,6160,8000,86000]
[9,9,900,1800,2700,3600,null,null,null,null,450,495,540,585,null,6930,9000,95000]
[10,10,1000,2000,3000,4000,null,null,null,null,500,550,600,650,null,7700,10000,105000]
[11,11,1100,2200,3300,4400,null,null,null,null,550,605,660,715,null,8470,11000,116000]
[12,12,1200,2400,3600,4800,null,null,null,null,600,660,720,780,null,9240,12000,128000]
[{"$f":"A17+1","v":13},13,1300,2600,3900,5200,null,null,null,null,650,715,780,845,null,10010,13000,141000]
[{"$f":"A18+1","v":14},14,1400,2800,4200,5600,null,null,null,null,700,770,840,910,null,10780,14000,155000]
[{"$f":"A19+1","v":15},15,1500,3000,4500,6000,null,null,null,null,750,825,900,975,null,11550,15000,170000]
{"$rows_left_out":50}
{"sheet":"BC_CSV","index":1,"n_rows":509,"n_cols":37,"rows_kept":509,"cut":false,"hidden":false,"merged":[]}
["Számlaszám","Számla típus","Hivatkozási számlaszám","Számla kelte","Telj. időpontja","Fiz. határidő","Fizetés módja","Rendelésszám","Nyelv","Devizanem","Árfolyam bank","Árfolyam","Vevő neve","Vevő irsz.","Vevő város","Vevő utca","Vevő adószám","Nettó összesen","Áfa összesen","Bruttó összesen","Főkönyv vevő","Főkönyv vevő azonosító","Főkönyvi dátum","Termék,szolgáltatás","Mennyiség","Mennyiségi egység","Nettó egységár","Áfakulcs","Tétel nettó érték","Tétel áfa érték","Tétel bruttó érték","Tétel árbevétel főkönyv","Tétel árbevétel áfa","Tétel gazdasági esemény","Tétel áfa gazdasági esemény","Tétel megjegyzés","Tétel árrés áfaalap"]
[{"$f":"Beallitasok!$B$2&PENZTAR_ADAT!B6","v":"AAA-1"},"SZ",null,{"$f":"DATE(PENZTAR_ADAT!$F$1,VLOOKUP(PENZTAR_ADAT!$H$1,Beallitasok!$K$2:$L$13,2,FALSE),PENZTAR_ADAT!A6)","v":"2021-01-01"},{"$f":"D2","v":"2021-01-01"},{"$f":"E2","v":"2021-01-01"},{"$f":"Beallitasok!$B$4","v":"Készpénz"},null,"hu","HUF",null,null,{"$f":"Beallitasok!$B$6","v":"AP_TESZT2"},null,null,null,null,{"$f":"SUMIF($A:$A,$A2,AC:AC)","v":1676},{"$f":"SUMIF($A:$A,$A2,AD:AD)","v":168},{"$f":"SUMIF($A:$A,$A2,AE:AE)","v":2000},{"$f":"Beallitasok!$B$9","v":381000},null,null,null,1,"db",{"$f":"AC2","v":79},{"$f":"IFERROR(VLOOKUP(PENZTAR_ADAT!$C$5,Beallitasok!$F$2:$G$6,2,FALSE),2)","v":"13.1"},{"$f":"ROUND(AE2/(1+PENZTAR_ADAT!$C$5),0)","v":79},{"$f":"AE2-AC2","v":21},{"$f":"PENZTAR_ADAT!C6","v":100},{"$f":"Beallitasok!$B$8","v":911000},null,null,null,{"$f":"Beallitasok!$B$11","v":"PTG árbevétel"}]
[{"$f":"A2","v":"AAA-1"},{"$f":"B2","v":"SZ"},null,"2021-01-01","2021-01-01","2021-01-01","Készpénz",null,"hu","HUF",null,null,"AP_TESZT2",null,null,null,null,1676,168,2000,381000,null,null,null,1,"db",{"$f":"AC3","v":190},{"$f":"IFERROR(VLOOKUP(PENZTAR_ADAT!$D$5,Beallitasok!$F$2:$G$6,2,FALSE),2)","v":"5.28"},{"$f":"ROUND(AE3/(1+PENZTAR_ADAT!$D$5),0)","v":190},21,{"$f":"PENZTAR_ADAT!D6","v":200},911000,null,null,null,"PTG árbevétel"]
[{"$f":"A3","v":"AAA-1"},{"$f":"B3","v":"SZ"},null,{"$f":"D3","v":"2021-01-01"},{"$f":"E3","v":"2021-01-01"},{"$f":"F3","v":"2021-01-01"},{"$f":"G3","v":"Készpénz"},null,{"$f":"I3","v":"hu"},{"$f":"J3","v":"HUF"},null,null,{"$f":"M3","v":"AP_TESZT2"},null,null,null,null,1676,168,2000,{"$f":"U3","v":381000},null,null,null,{"$f":"Y3","v":1},{"$f":"Z3","v":"db"},254,{"$f":"IFERROR(VLOOKUP(PENZTAR_ADAT!$E$5,Beallitasok!$F$2:$G$6,2,FALSE),2)","v":"12.26"},{"$f":"ROUND(AE4/(1+PENZTAR_ADAT!$E$5),0)","v":254},{"$f":"AD3","v":21},{"$f":"PENZTAR_ADAT!E6","v":300},{"$f":"AF3","v":911000},null,null,null,{"$f":"AJ3","v":"PTG árbevétel"}]
[{"$f":"A4","v":"AAA-1"},"SZ",null,"2021-01-01","2021-01-01","2021-01-01","Készpénz",null,"hu","HUF",null,null,"AP_TESZT2",null,null,null,null,1676,168,2000,381000,null,null,null,1,"db",315,{"$f":"IFERROR(VLOOKUP(PENZTAR_ADAT!$F$5,Beallitasok!$F$2:$G$6,2,FALSE),2)","v":"13.1"},{"$f":"ROUND(AE5/(1+PENZTAR_ADAT!$F$5),0)","v":315},21,{"$f":"PENZTAR_ADAT!F6","v":400},911000,null,null,null,"PTG árbevétel"]
[{"$f":"Beallitasok!$B$2&PENZTAR_ADAT!B7","v":"AAA-2"},"SZ",null,{"$f":"DATE(PENZTAR_ADAT!$F$1,VLOOKUP(PENZTAR_ADAT!$H$1,Beallitasok!$K$2:$L$13,2,FALSE),PENZTAR_ADAT!A7)","v":"2021-01-02"},{"$f":"D6","v":"2021-01-02"},{"$f":"E6","v":"2021-01-02"},{"$f":"Beallitasok!$B$4","v":"Készpénz"},null,"hu","HUF",null,null,{"$f":"Beallitasok!$B$6","v":"AP_TESZT2"},null,null,null,null,3352,344,4000,{"$f":"Beallitasok!$B$9","v":381000},null,null,null,1,"db",157,{"$f":"IFERROR(VLOOKUP(PENZTAR_ADAT!$C$5,Beallitasok!$F$2:$G$6,2,FALSE),2)","v":"13.1"},{"$f":"ROUND(AE6/(1+PENZTAR_ADAT!$C$5),0)","v":157},{"$f":"AE6-AC6","v":43},{"$f":"PENZTAR_ADAT!C7","v":200},{"$f":"Beallitasok!$B$8","v":911000},null,null,null,{"$f":"Beallitasok!$B$11","v":"PTG árbevétel"}]
[{"$f":"A6","v":"AAA-2"},{"$f":"B6","v":"SZ"},null,{"$f":"D6","v":"2021-01-02"},{"$f":"E6","v":"2021-01-02"},{"$f":"F6","v":"2021-01-02"},{"$f":"G6","v":"Készpénz"},null,{"$f":"I6","v":"hu"},{"$f":"J6","v":"HUF"},null,null,{"$f":"M6","v":"AP_TESZT2"},null,null,null,null,3352,344,4000,{"$f":"U6","v":381000},null,null,null,{"$f":"Y6","v":1},{"$f":"Z6","v":"db"},381,{"$f":"IFERROR(VLOOKUP(PENZTAR_ADAT!$D$5,Beallitasok!$F$2:$G$6,2,FALSE),2)","v":"5.28"},{"$f":"ROUND(AE7/(1+PENZTAR_ADAT!$D$5),0)","v":381},{"$f":"AD6","v":43},{"$f":"PENZTAR_ADAT!D7","v":400},{"$f":"AF6","v":911000},null,null,null,{"$f":"AJ6","v":"PTG árbevétel"}]
[{"$f":"A7","v":"AAA-2"},"SZ",null,"2021-01-02","2021-01-02","2021-01-02","Készpénz",null,"hu","HUF",null,null,"AP_TESZT2",null,null,null,null,3352,344,4000,381000,null,null,null,1,"db",508,{"$f":"IFERROR(VLOOKUP(PENZTAR_ADAT!$E$5,Beallitasok!$F$2:$G$6,2,FALSE),2)","v":"12.26"},{"$f":"ROUND(AE8/(1+PENZTAR_ADAT!$E$5),0)","v":508},43,{"$f":"PENZTAR_ADAT!E7","v":600},911000,null,null,null,"PTG árbevétel"]
[{"$f":"A8","v":"AAA-2"},"SZ",null,"2021-01-02","2021-01-02","2021-01-02","Készpénz",null,"hu","HUF",null,null,"AP_TESZT2",null,null,null,null,3352,344,4000,381000,null,null,null,1,"db",630,{"$f":"IFERROR(VLOOKUP(PENZTAR_ADAT!$F$5,Beallitasok!$F$2:$G$6,2,FALSE),2)","v":"13.1"},{"$f":"ROUND(AE9/(1+PENZTAR_ADAT!$F$5),0)","v":630},43,{"$f":"PENZTAR_ADAT!F7","v":800},911000,null,null,null,"PTG árbevétel"]
[{"$f":"Beallitasok!$B$2&PENZTAR_ADAT!B8","v":"AAA-3"},"SZ",null,{"$f":"DATE(PENZTAR_ADAT!$F$1,VLOOKUP(PENZTAR_ADAT!$H$1,Beallitasok!$K$2:$L$13,2,FALSE),PENZTAR_ADAT!A8)","v":"2021-01-03"},{"$f":"D10","v":"2021-01-03"},{"$f":"E10","v":"2021-01-03"},{"$f":"Beallitasok!$B$4","v":"Készpénz"},null,"hu","HUF",null,null,{"$f":"Beallitasok!$B$6","v":"AP_TESZT2"},null,null,null,null,5030,512,6000,{"$f":"Beallitasok!$B$9","v":381000},null,null,null,1,"db",236,{"$f":"IFERROR(VLOOKUP(PENZTAR_ADAT!$C$5,Beallitasok!$F$2:$G$6,2,FALSE),2)","v":"13.1"},{"$f":"ROUND(AE10/(1+PENZTAR_ADAT!$C$5),0)","v":236},{"$f":"AE10-AC10","v":64},{"$f":"PENZTAR_ADAT!C8","v":300},{"$f":"Beallitasok!$B$8","v":911000},null,null,null,{"$f":"Beallitasok!$B$11","v":"PTG árbevétel"}]
[{"$f":"A10","v":"AAA-3"},{"$f":"B10","v":"SZ"},null,"2021-01-03",{"$f":"E10","v":"2021-01-03"},{"$f":"F10","v":"2021-01-03"},{"$f":"G10","v":"Készpénz"},null,{"$f":"I10","v":"hu"},{"$f":"J10","v":"HUF"},null,null,{"$f":"M10","v":"AP_TESZT2"},null,null,null,null,5030,512,6000,{"$f":"U10","v":381000},null,null,null,{"$f":"Y10","v":1},{"$f":"Z10","v":"db"},571,{"$f":"IFERROR(VLOOKUP(PENZTAR_ADAT!$D$5,Beallitasok!$F$2:$G$6,2,FALSE),2)","v":"5.28"},{"$f":"ROUND(AE11/(1+PENZTAR_ADAT!$D$5),0)","v":571},{"$f":"AD10","v":64},{"$f":"PENZTAR_ADAT!D8","v":600},{"$f":"AF10","v":911000},null,null,null,{"$f":"AJ10","v":"PTG árbevétel"}]
[{"$f":"A11","v":"AAA-3"},"SZ",null,"2021-01-03","2021-01-03","2021-01-03","Készpénz",null,"hu","HUF",null,null,"AP_TESZT2",null,null,null,null,5030,512,6000,381000,null,null,null,1,"db",763,{"$f":"IFERROR(VLOOKUP(PENZTAR_ADAT!$E$5,Beallitasok!$F$2:$G$6,2,FALSE),2)","v":"12.26"},{"$f":"ROUND(AE12/(1+PENZTAR_ADAT!$E$5),0)","v":763},64,{"$f":"PENZTAR_ADAT!E8","v":900},911000,null,null,null,"PTG árbevétel"]
[{"$f":"A12","v":"AAA-3"},"SZ",null,"2021-01-03","2021-01-03","2021-01-03","Készpénz",null,"hu","HUF",null,null,"AP_TESZT2",null,null,null,null,5030,512,6000,381000,null,null,null,1,"db",945,{"$f":"IFERROR(VLOOKUP(PENZTAR_ADAT!$F$5,Beallitasok!$F$2:$G$6,2,FALSE),2)","v":"13.1"},{"$f":"ROUND(AE13/(1+PENZTAR_ADAT!$F$5),0)","v":945},64,{"$f":"PENZTAR_ADAT!F8","v":1200},911000,null,null,null,"PTG árbevétel"]
[{"$f":"Beallitasok!$B$2&PENZTAR_ADAT!B9","v":"AAA-4"},"SZ",null,{"$f":"DATE(PENZTAR_ADAT!$F$1,VLOOKUP(PENZTAR_ADAT!$H$1,Beallitasok!$K$2:$L$13,2,FALSE),PENZTAR_ADAT!A9)","v":"2021-01-04"},{"$f":"D14","v":"2021-01-04"},{"$f":"E14","v":"2021-01-04"},{"$f":"Beallitasok!$B$4","v":"Készpénz"},null,"hu","HUF",null,null,{"$f":"Beallitasok!$B$6","v":"AP_TESZT2"},null,null,null,null,6708,680,8000,{"$f":"Beallitasok!$B$9","v":381000},null,null,null,1,"db",315,{"$f":"IFERROR(VLOOKUP(PENZTAR_ADAT!$C$5,Beallitasok!$F$2:$G$6,2,FALSE),2)","v":"13.1"},{"$f":"ROUND(AE14/(1+PENZTAR_ADAT!$C$5),0)","v":315},{"$f":"AE14-AC14","v":85},{"$f":"PENZTAR_ADAT!C9","v":400},{"$f":"Beallitasok!$B$8","v":911000},null,null,null,{"$f":"Beallitasok!$B$11","v":"PTG árbevétel"}]
[{"$f":"A14","v":"AAA-4"},{"$f":"B14","v":"SZ"},null,"2021-01-04",{"$f":"E14","v":"2021-01-04"},{"$f":"F14","v":"2021-01-04"},{"$f":"G14","v":"Készpénz"},null,{"$f":"I14","v":"hu"},{"$f":"J14","v":"HUF"},null,null,{"$f":"M14","v":"AP_TESZT2"},null,null,null,null,6708,680,8000,{"$f":"U14","v":381000},null,null,null,{"$f":"Y14","v":1},{"$f":"Z14","v":"db"},762,{"$f":"IFERROR(VLOOKUP(PENZTAR_ADAT!$D$5,Beallitasok!$F$2:$G$6,2,FALSE),2)","v":"5.28"},{"$f":"ROUND(AE15/(1+PENZTAR_ADAT!$D$5),0)","v":762},{"$f":"AD14","v":85},{"$f":"PENZTAR_ADAT!D9","v":800},{"$f":"AF14","v":911000},null,null,null,{"$f":"AJ14","v":"PTG árbevétel"}]
[{"$f":"A15","v":"AAA-4"},"SZ",null,"2021-01-04","2021-01-04","2021-01-04","Készpénz",null,"hu","HUF",null,null,"AP_TESZT2",null,null,null,null,6708,680,8000,381000,null,null,null,1,"db",1017,{"$f":"IFERROR(VLOOKUP(PENZTAR_ADAT!$E$5,Beallitasok!$F$2:$G$6,2,FALSE),2)","v":"12.26"},{"$f":"ROUND(AE16/(1+PENZTAR_ADAT!$E$5),0)","v":1017},85,{"$f":"PENZTAR_ADAT!E9","v":1200},911000,null,null,null,"PTG árbevétel"]
[{"$f":"A16","v":"AAA-4"},"SZ",null,"2021-01-04","2021-01-04","2021-01-04","Készpénz",null,"hu","HUF",null,null,"AP_TESZT2",null,null,null,null,6708,680,8000,381000,null,null,null,1,"db",1260,{"$f":"IFERROR(VLOOKUP(PENZTAR_ADAT!$F$5,Beallitasok!$F$2:$G$6,2,FALSE),2)","v":"13.1"},{"$f":"ROUND(AE17/(1+PENZTAR_ADAT!$F$5),0)","v":1260},85,{"$f":"PENZTAR_ADAT!F9","v":1600},911000,null,null,null,"PTG árbevétel"]
[{"$f":"Beallitasok!$B$2&PENZTAR_ADAT!B10","v":"AAA-5"},"SZ",null,{"$f":"DATE(PENZTAR_ADAT!$F$1,VLOOKUP(PENZTAR_ADAT!$H$1,Beallitasok!$K$2:$L$13,2,FALSE),PENZTAR_ADAT!A10)","v":"2021-01-05"},{"$f":"D18","v":"2021-01-05"},"2021-01-05",{"$f":"Beallitasok!$B$4","v":"Készpénz"},null,"hu","HUF",null,null,{"$f":"Beallitasok!$B$6","v":"AP_TESZT2"},null,null,null,null,8384,848,10000,{"$f":"Beallitasok!$B$9","v":381000},null,null,null,1,"db",394,{"$f":"IFERROR(VLOOKUP(PENZTAR_ADAT!$C$5,Beallitasok!$F$2:$G$6,2,FALSE),2)","v":"13.1"},{"$f":"ROUND(AE18/(1+PENZTAR_ADAT!$C$5),0)","v":394},{"$f":"AE18-AC18","v":106},{"$f":"PENZTAR_ADAT!C10","v":500},{"$f":"Beallitasok!$B$8","v":911000},null,null,null,{"$f":"Beallitasok!$B$11","v":"PTG árbevétel"}]
[{"$f":"A18","v":"AAA-5"},{"$f":"B18","v":"SZ"},null,"2021-01-05",{"$f":"E18","v":"2021-01-05"},{"$f":"F18","v":"2021-01-05"},{"$f":"G18","v":"Készpénz"},null,{"$f":"I18","v":"hu"},{"$f":"J18","v":"HUF"},null,null,{"$f":"M18","v":"AP_TESZT2"},null,null,null,null,8384,848,10000,{"$f":"U18","v":381000},null,null,null,{"$f":"Y18","v":1},{"$f":"Z18","v":"db"},952,{"$f":"IFERROR(VLOOKUP(PENZTAR_ADAT!$D$5,Beallitasok!$F$2:$G$6,2,FALSE),2)","v":"5.28"},{"$f":"ROUND(AE19/(1+PENZTAR_ADAT!$D$5),0)","v":952},{"$f":"AD18","v":106},{"$f":"PENZTAR_ADAT!D10","v":1000},{"$f":"AF18","v":911000},null,null,null,{"$f":"AJ18","v":"PTG árbevétel"}]
["AAA-5","SZ",null,"2021-01-05","2021-01-05","2021-01-05","Készpénz",null,"hu","HUF",null,null,"AP_TESZT2",null,null,null,null,8384,848,10000,381000,null,null,null,1,"db",1271,{"$f":"IFERROR(VLOOKUP(PENZTAR_ADAT!$E$5,Beallitasok!$F$2:$G$6,2,FALSE),2)","v":"12.26"},{"$f":"ROUND(AE20/(1+PENZTAR_ADAT!$E$5),0)","v":1271},106,{"$f":"PENZTAR_ADAT!E10","v":1500},911000,null,null,null,"PTG árbevétel"]
{"$rows_left_out":490}
{"sheet":"9_OSZLOPOS","index":2,"n_rows":317,"n_cols":9,"rows_kept":317,"cut":false,"hidden":true,"merged":[]}
["Dátum","Megnevezés","Bizonylatjel","Összeg","Tartozik","Kovetel","KTGHELY","Tartozik megnevezés","Követel megnevezés"]
[{"$f":"DATE(PENZTAR_ADAT!$F$1,VLOOKUP(PENZTAR_ADAT!$H$1,Beallitasok!$K$2:$L$13,2,FALSE),PENZTAR_ADAT!A6)","v":"2021-01-01"},{"$f":"Beallitasok!$A$14","v":"BANKKÁRTYA"},{"$f":"Beallitasok!$B$3&PENZTAR_ADAT!B6","v":"BBB-1"},{"$f":"PENZTAR_ADAT!K6","v":50},{"$f":"Beallitasok!$B$15","v":361000},{"$f":"Beallitasok!$C$15","v":381000},null,{"$f":"IF(Beallitasok!$B$16=\"\",\"\",Beallitasok!$B$16)","v":"BK T"},{"$f":"IF(Beallitasok!$C$16=\"\",\"\",Beallitasok!$C$16)","v":"BK K"}]
[{"$f":"DATE(PENZTAR_ADAT!$F$1,VLOOKUP(PENZTAR_ADAT!$H$1,Beallitasok!$K$2:$L$13,2,FALSE),PENZTAR_ADAT!A7)","v":"2021-01-02"},{"$f":"Beallitasok!$A$14","v":"BANKKÁRTYA"},{"$f":"Beallitasok!$B$3&PENZTAR_ADAT!B7","v":"BBB-2"},{"$f":"PENZTAR_ADAT!K7","v":100},{"$f":"Beallitasok!$B$15","v":361000},{"$f":"Beallitasok!$C$15","v":381000},null,{"$f":"IF(Beallitasok!$B$16=\"\",\"\",Beallitasok!$B$16)","v":"BK T"},{"$f":"IF(Beallitasok!$C$16=\"\",\"\",Beallitasok!$C$16)","v":"BK K"}]
[{"$f":"DATE(PENZTAR_ADAT!$F$1,VLOOKUP(PENZTAR_ADAT!$H$1,Beallitasok!$K$2:$L$13,2,FALSE),PENZTAR_ADAT!A8)","v":"2021-01-03"},{"$f":"Beallitasok!$A$14","v":"BANKKÁRTYA"},{"$f":"Beallitasok!$B$3&PENZTAR_ADAT!B8","v":"BBB-3"},{"$f":"PENZTAR_ADAT!K8","v":150},{"$f":"Beallitasok!$B$15","v":361000},{"$f":"Beallitasok!$C$15","v":381000},null,{"$f":"IF(Beallitasok!$B$16=\"\",\"\",Beallitasok!$B$16)","v":"BK T"},{"$f":"IF(Beallitasok!$C$16=\"\",\"\",Beallitasok!$C$16)","v":"BK K"}]
[{"$f":"DATE(PENZTAR_ADAT!$F$1,VLOOKUP(PENZTAR_ADAT!$H$1,Beallitasok!$K$2:$L$13,2,FALSE),PENZTAR_ADAT!A9)","v":"2021-01-04"},{"$f":"Beallitasok!$A$14","v":"BANKKÁRTYA"},{"$f":"Beallitasok!$B$3&PENZTAR_ADAT!B9","v":"BBB-4"},{"$f":"PENZTAR_ADAT!K9","v":200},{"$f":"Beallitasok!$B$15","v":361000},{"$f":"Beallitasok!$C$15","v":381000},null,{"$f":"IF(Beallitasok!$B$16=\"\",\"\",Beallitasok!$B$16)","v":"BK T"},{"$f":"IF(Beallitasok!$C$16=\"\",\"\",Beallitasok!$C$16)","v":"BK K"}]
[{"$f":"DATE(PENZTAR_ADAT!$F$1,VLOOKUP(PENZTAR_ADAT!$H$1,Beallitasok!$K$2:$L$13,2,FALSE),PENZTAR_ADAT!A10)","v":"2021-01-05"},{"$f":"Beallitasok!$A$14","v":"BANKKÁRTYA"},{"$f":"Beallitasok!$B$3&PENZTAR_ADAT!B10","v":"BBB-5"},{"$f":"PENZTAR_ADAT!K10","v":250},{"$f":"Beallitasok!$B$15","v":361000},{"$f":"Beallitasok!$C$15","v":381000},null,{"$f":"IF(Beallitasok!$B$16=\"\",\"\",Beallitasok!$B$16)","v":"BK T"},{"$f":"IF(Beallitasok!$C$16=\"\",\"\",Beallitasok!$C$16)","v":"BK K"}]
[{"$f":"DATE(PENZTAR_ADAT!$F$1,VLOOKUP(PENZTAR_ADAT!$H$1,Beallitasok!$K$2:$L$13,2,FALSE),PENZTAR_ADAT!A11)","v":"2021-01-06"},{"$f":"Beallitasok!$A$14","v":"BANKKÁRTYA"},{"$f":"Beallitasok!$B$3&PENZTAR_ADAT!B11","v":"BBB-6"},{"$f":"PENZTAR_ADAT!K11","v":300},{"$f":"Beallitasok!$B$15","v":361000},{"$f":"Beallitasok!$C$15","v":381000},null,{"$f":"IF(Beallitasok!$B$16=\"\",\"\",Beallitasok!$B$16)","v":"BK T"},{"$f":"IF(Beallitasok!$C$16=\"\",\"\",Beallitasok!$C$16)","v":"BK K"}]
[{"$f":"DATE(PENZTAR_ADAT!$F$1,VLOOKUP(PENZTAR_ADAT!$H$1,Beallitasok!$K$2:$L$13,2,FALSE),PENZTAR_ADAT!A12)","v":"2021-01-07"},{"$f":"Beallitasok!$A$14","v":"BANKKÁRTYA"},{"$f":"Beallitasok!$B$3&PENZTAR_ADAT!B12","v":"BBB-7"},{"$f":"PENZTAR_ADAT!K12","v":350},{"$f":"Beallitasok!$B$15","v":361000},{"$f":"Beallitasok!$C$15","v":381000},null,{"$f":"IF(Beallitasok!$B$16=\"\",\"\",Beallitasok!$B$16)","v":"BK T"},{"$f":"IF(Beallitasok!$C$16=\"\",\"\",Beallitasok!$C$16)","v":"BK K"}]
[{"$f":"DATE(PENZTAR_ADAT!$F$1,VLOOKUP(PENZTAR_ADAT!$H$1,Beallitasok!$K$2:$L$13,2,FALSE),PENZTAR_ADAT!A13)","v":"2021-01-08"},{"$f":"Beallitasok!$A$14","v":"BANKKÁRTYA"},{"$f":"Beallitasok!$B$3&PENZTAR_ADAT!B13","v":"BBB-8"},{"$f":"PENZTAR_ADAT!K13","v":400},{"$f":"Beallitasok!$B$15","v":361000},{"$f":"Beallitasok!$C$15","v":381000},null,{"$f":"IF(Beallitasok!$B$16=\"\",\"\",Beallitasok!$B$16)","v":"BK T"},{"$f":"IF(Beallitasok!$C$16=\"\",\"\",Beallitasok!$C$16)","v":"BK K"}]
[{"$f":"DATE(PENZTAR_ADAT!$F$1,VLOOKUP(PENZTAR_ADAT!$H$1,Beallitasok!$K$2:$L$13,2,FALSE),PENZTAR_ADAT!A14)","v":"2021-01-09"},{"$f":"Beallitasok!$A$14","v":"BANKKÁRTYA"},{"$f":"Beallitasok!$B$3&PENZTAR_ADAT!B14","v":"BBB-9"},{"$f":"PENZTAR_ADAT!K14","v":450},{"$f":"Beallitasok!$B$15","v":361000},{"$f":"Beallitasok!$C$15","v":381000},null,{"$f":"IF(Beallitasok!$B$16=\"\",\"\",Beallitasok!$B$16)","v":"BK T"},{"$f":"IF(Beallitasok!$C$16=\"\",\"\",Beallitasok!$C$16)","v":"BK K"}]
[{"$f":"DATE(PENZTAR_ADAT!$F$1,VLOOKUP(PENZTAR_ADAT!$H$1,Beallitasok!$K$2:$L$13,2,FALSE),PENZTAR_ADAT!A15)","v":"2021-01-10"},{"$f":"Beallitasok!$A$14","v":"BANKKÁRTYA"},{"$f":"Beallitasok!$B$3&PENZTAR_ADAT!B15","v":"BBB-10"},{"$f":"PENZTAR_ADAT!K15","v":500},{"$f":"Beallitasok!$B$15","v":361000},{"$f":"Beallitasok!$C$15","v":381000},null,{"$f":"IF(Beallitasok!$B$16=\"\",\"\",Beallitasok!$B$16)","v":"BK T"},{"$f":"IF(Beallitasok!$C$16=\"\",\"\",Beallitasok!$C$16)","v":"BK K"}]
[{"$f":"DATE(PENZTAR_ADAT!$F$1,VLOOKUP(PENZTAR_ADAT!$H$1,Beallitasok!$K$2:$L$13,2,FALSE),PENZTAR_ADAT!A16)","v":"2021-01-11"},{"$f":"Beallitasok!$A$14","v":"BANKKÁRTYA"},{"$f":"Beallitasok!$B$3&PENZTAR_ADAT!B16","v":"BBB-11"},{"$f":"PENZTAR_ADAT!K16","v":550},{"$f":"Beallitasok!$B$15","v":361000},{"$f":"Beallitasok!$C$15","v":381000},null,{"$f":"IF(Beallitasok!$B$16=\"\",\"\",Beallitasok!$B$16)","v":"BK T"},{"$f":"IF(Beallitasok!$C$16=\"\",\"\",Beallitasok!$C$16)","v":"BK K"}]
[{"$f":"DATE(PENZTAR_ADAT!$F$1,VLOOKUP(PENZTAR_ADAT!$H$1,Beallitasok!$K$2:$L$13,2,FALSE),PENZTAR_ADAT!A17)","v":"2021-01-12"},{"$f":"Beallitasok!$A$14","v":"BANKKÁRTYA"},{"$f":"Beallitasok!$B$3&PENZTAR_ADAT!B17","v":"BBB-12"},{"$f":"PENZTAR_ADAT!K17","v":600},{"$f":"Beallitasok!$B$15","v":361000},{"$f":"Beallitasok!$C$15","v":381000},null,{"$f":"IF(Beallitasok!$B$16=\"\",\"\",Beallitasok!$B$16)","v":"BK T"},{"$f":"IF(Beallitasok!$C$16=\"\",\"\",Beallitasok!$C$16)","v":"BK K"}]
[{"$f":"DATE(PENZTAR_ADAT!$F$1,VLOOKUP(PENZTAR_ADAT!$H$1,Beallitasok!$K$2:$L$13,2,FALSE),PENZTAR_ADAT!A18)","v":"2021-01-13"},{"$f":"Beallitasok!$A$14","v":"BANKKÁRTYA"},{"$f":"Beallitasok!$B$3&PENZTAR_ADAT!B18","v":"BBB-13"},{"$f":"PENZTAR_ADAT!K18","v":650},{"$f":"Beallitasok!$B$15","v":361000},{"$f":"Beallitasok!$C$15","v":381000},null,{"$f":"IF(Beallitasok!$B$16=\"\",\"\",Beallitasok!$B$16)","v":"BK T"},{"$f":"IF(Beallitasok!$C$16=\"\",\"\",Beallitasok!$C$16)","v":"BK K"}]
[{"$f":"DATE(PENZTAR_ADAT!$F$1,VLOOKUP(PENZTAR_ADAT!$H$1,Beallitasok!$K$2:$L$13,2,FALSE),PENZTAR_ADAT!A19)","v":"2021-01-14"},{"$f":"Beallitasok!$A$14","v":"BANKKÁRTYA"},{"$f":"Beallitasok!$B$3&PENZTAR_ADAT!B19","v":"BBB-14"},{"$f":"PENZTAR_ADAT!K19","v":700},{"$f":"Beallitasok!$B$15","v":361000},{"$f":"Beallitasok!$C$15","v":381000},null,{"$f":"IF(Beallitasok!$B$16=\"\",\"\",Beallitasok!$B$16)","v":"BK T"},{"$f":"IF(Beallitasok!$C$16=\"\",\"\",Beallitasok!$C$16)","v":"BK K"}]
[{"$f":"DATE(PENZTAR_ADAT!$F$1,VLOOKUP(PENZTAR_ADAT!$H$1,Beallitasok!$K$2:$L$13,2,FALSE),PENZTAR_ADAT!A20)","v":"2021-01-15"},{"$f":"Beallitasok!$A$14","v":"BANKKÁRTYA"},{"$f":"Beallitasok!$B$3&PENZTAR_ADAT!B20","v":"BBB-15"},{"$f":"PENZTAR_ADAT!K20","v":750},{"$f":"Beallitasok!$B$15","v":361000},{"$f":"Beallitasok!$C$15","v":381000},null,{"$f":"IF(Beallitasok!$B$16=\"\",\"\",Beallitasok!$B$16)","v":"BK T"},{"$f":"IF(Beallitasok!$C$16=\"\",\"\",Beallitasok!$C$16)","v":"BK K"}]
[{"$f":"DATE(PENZTAR_ADAT!$F$1,VLOOKUP(PENZTAR_ADAT!$H$1,Beallitasok!$K$2:$L$13,2,FALSE),PENZTAR_ADAT!A21)","v":"2021-01-16"},{"$f":"Beallitasok!$A$14","v":"BANKKÁRTYA"},{"$f":"Beallitasok!$B$3&PENZTAR_ADAT!B21","v":"BBB-16"},{"$f":"PENZTAR_ADAT!K21","v":800},{"$f":"Beallitasok!$B$15","v":361000},{"$f":"Beallitasok!$C$15","v":381000},null,{"$f":"IF(Beallitasok!$B$16=\"\",\"\",Beallitasok!$B$16)","v":"BK T"},{"$f":"IF(Beallitasok!$C$16=\"\",\"\",Beallitasok!$C$16)","v":"BK K"}]
[{"$f":"DATE(PENZTAR_ADAT!$F$1,VLOOKUP(PENZTAR_ADAT!$H$1,Beallitasok!$K$2:$L$13,2,FALSE),PENZTAR_ADAT!A22)","v":"2021-01-17"},{"$f":"Beallitasok!$A$14","v":"BANKKÁRTYA"},{"$f":"Beallitasok!$B$3&PENZTAR_ADAT!B22","v":"BBB-17"},{"$f":"PENZTAR_ADAT!K22","v":850},{"$f":"Beallitasok!$B$15","v":361000},{"$f":"Beallitasok!$C$15","v":381000},null,{"$f":"IF(Beallitasok!$B$16=\"\",\"\",Beallitasok!$B$16)","v":"BK T"},{"$f":"IF(Beallitasok!$C$16=\"\",\"\",Beallitasok!$C$16)","v":"BK K"}]
[{"$f":"DATE(PENZTAR_ADAT!$F$1,VLOOKUP(PENZTAR_ADAT!$H$1,Beallitasok!$K$2:$L$13,2,FALSE),PENZTAR_ADAT!A23)","v":"2021-01-18"},{"$f":"Beallitasok!$A$14","v":"BANKKÁRTYA"},{"$f":"Beallitasok!$B$3&PENZTAR_ADAT!B23","v":"BBB-18"},{"$f":"PENZTAR_ADAT!K23","v":900},{"$f":"Beallitasok!$B$15","v":361000},{"$f":"Beallitasok!$C$15","v":381000},null,{"$f":"IF(Beallitasok!$B$16=\"\",\"\",Beallitasok!$B$16)","v":"BK T"},{"$f":"IF(Beallitasok!$C$16=\"\",\"\",Beallitasok!$C$16)","v":"BK K"}]
[{"$f":"DATE(PENZTAR_ADAT!$F$1,VLOOKUP(PENZTAR_ADAT!$H$1,Beallitasok!$K$2:$L$13,2,FALSE),PENZTAR_ADAT!A24)","v":"2021-01-19"},{"$f":"Beallitasok!$A$14","v":"BANKKÁRTYA"},{"$f":"Beallitasok!$B$3&PENZTAR_ADAT!B24","v":"BBB-19"},{"$f":"PENZTAR_ADAT!K24","v":950},{"$f":"Beallitasok!$B$15","v":361000},{"$f":"Beallitasok!$C$15","v":381000},null,{"$f":"IF(Beallitasok!$B$16=\"\",\"\",Beallitasok!$B$16)","v":"BK T"},{"$f":"IF(Beallitasok!$C$16=\"\",\"\",Beallitasok!$C$16)","v":"BK K"}]
{"$rows_left_out":298}
{"sheet":"Beallitasok","index":3,"n_rows":20,"n_cols":12,"rows_kept":20,"cut":false,"hidden":false,"merged":[[0,5,0,6],[13,4,13,5],[14,4,14,5],[15,4,15,5],[17,4,17,5],[7,4,7,5],[10,4,11,4],[8,4,9,4],[18,4,18,5],[19,4,19,5],[10,1,10,2],[11,1,11,2],[1,1,1,2],[2,1,2,2],[3,1,3,2],[4,1,4,2],[5,1,5,2]]}
[null,null,null,null,null,"Áfa kulcs",null,null,null,null,"Hónap","Sorszám"]
["PTG Bizonylat előtag","AAA-",null,null,null,0,"10",null,null,null,"Január",1]
["Bank Bizonylat előtag","BBB-",null,null,null,0.05,"5.28",null,null,null,"Február",2]
["Fizmod KP","Készpénz",null,null,null,0.18,"12.26",null,null,null,"Március",3]
["Cég neve","Sarki_ABC",null,null,null,0.27,"13.1",null,null,null,"Április",4]
["Pénztárgép száma","AP_TESZT2",null,null,null,null,null,null,null,null,"Május",5]
[null,null,null,null,null,null,null,null,null,null,"Június",6]
["Bevétel főkönyv",911000,null,null,{"$f":"PENZTAR_ADAT!O5","v":"Kerekítés"},null,"T","K",null,null,"Július",7]
["Pénztár főkönyv",381000,null,null,"Ha plusz","FK szám",361000,381000,null,null,"Augusztus",8]
[null,null,null,null,null,"FK név","Kerek+ T","Kerek+ K",null,null,"Szeptember",9]
["PTGbevétel megjegyzés","PTG árbevétel",null,null,"Ha mínusz","FK szám",361000,381000,null,null,"Október",10]
["Téves beütés","Téves beütés",null,null,null,"FK név","Kerek- T","Kerek- K",null,null,"November",11]
[null,null,null,null,null,null,null,null,null,null,"December",12]
[{"$f":"PENZTAR_ADAT!K5","v":"BANKKÁRTYA"},"T","K",null,{"$f":"PENZTAR_ADAT!M5","v":"MKB SZÉP KÁRTYA"},null,"T","K"]
["Főkönyv számok",361000,381000,null,"Főkönyv számok",null,361000,381000]
["Főkönyv neve","BK T","BK K",null,"Főkönyv neve",null,"UTA T","UTA K"]
[]
[{"$f":"PENZTAR_ADAT!L5","v":"Netpincér"},"T","K",null,{"$f":"PENZTAR_ADAT!N5","v":"Szép"},null,"T","K"]
["Főkönyv számok",361000,381000,null,"Főkönyv számok",null,361000,381000]
["Főkönyv neve","NET T","NET K",null,"Főkönyv neve",null,"SZÉP T","SZÉP K"]