{"text_format":"1","workbook":"xlsx","n_sheets":4,"sheets":["ZARO_FOKONYV","beallitasok","RELAX_feladas","FKCSERE"],"not_rendered":{"charts":0,"images":0,"macros":1,"external_links":0,"defined_names":0,"comments":2,"pivot_tables":0},"unopened":[],"bounds":{"document_bytes":16777216,"sheet_cells":100000,"rows_first":2000,"rows_last":500,"rows_between":2000,"halvings":0,"cell_chars":16384,"cell_head_chars":4096},"cells_cut":0,"cells_raw":0,"read":"whole","date_system":"1900"}

{"sheet":"ZARO_FOKONYV","index":0,"n_rows":162,"n_cols":4,"rows_kept":162,"cut":false,"hidden":false,"merged":[]}
["FK szám","FK neve","tartozik egyenleg","követel egyenleg"]
["1","BEFEKTETETT ESZKÖZÖK",61563416,0]
["11","IMMATERIÁLIS JAVAK",0,0]
["113","Vagyoni értékű jogok",78737,0]
["114","Szellemi termékek",21000,0]
["119","Immateriális javak terv szerinti értékcsökkenése",0,99737]
["12","INGATLANOK ÉS KAPCSOLÓDÓ VAGYONI ÉRTÉKŰ JOGOK",49105108,0]
["123","Épületek, épületrészek, tulajdoni hányadok",52000012,0]
["129","Ingatlanok terv szerinti értékcsökkenése",0,2894904]
["14","EGYÉB BERENDEZÉSEK, FELSZERELÉSEK, GÉPEK, JÁRMŰVEK",8907049,0]
["1411","Üzemi berend.tárgyak",5834040,0]
["142","Egyéb járművek",12820711,0]
["143","Irodai, igazgatási berendezések és felszerelések",3460124,0]
["1431","Adatrögzítő készölékek",5820273,0]
["144","Üzemkörön kívüli berendezése, felszerelések, járművek",169900,0]
{"$rows_left_out":148}
{"sheet":"beallitasok","index":1,"n_rows":8,"n_cols":8,"rows_kept":8,"cut":false,"hidden":false,"merged":[[4,6,5,6],[4,7,5,7]]}
[]
["Dátum","2020-12-31",null,null,null,null,"Vevő eleje",311]
["Ellenszámla",491000,null,null,null,null,"Szállító eleje",454]
["File neve","VALAMI"]
["Sorszám",19,null,null,null,null,"Gyűjtősorok törlése","IGEN"]
["Bizonylatjel","NYITÓ"]
[]
[null,null,null,null,null,null,"Hányas osztályig?",9]

{"sheet":"RELAX_feladas","index":2,"n_rows":162,"n_cols":10,"rows_kept":162,"cut":false,"hidden":false,"merged":[]}
["Dátum","Megnevezés","Bizonylatjel","Összeg","Tartozik","Kovetel","KTGHELY","Tartozik megnevezés","Követel megnevezés","Gyűjtő?"]
[{"$f":"IFERROR(IF(OR(AND(beallitasok!$H$5=\"IGEN\",J2=\"IGEN\"),B2=\"\",VALUE(LEFT(F2,LEN(beallitasok!$H$2)))=beallitasok!$H$2,VALUE(LEFT(E2,LEN(beallitasok!$H$3)))=beallitasok!$H$3,VALUE(LEFT(F2,LEN(beallitasok!$H$2)))=beallitasok!$H$3,VALUE(LEFT(E2,LEN(beallitasok!$H$3)))=beallitasok!$H$2),\"\",IF(D2=\"\",\"\",beallitasok!$B$2)),\"\")","v":""},{"$f":"IF(VALUE(LEFT(ZARO_FOKONYV!A2,1))<=beallitasok!$H$8,ZARO_FOKONYV!B2,\"\")","v":"BEFEKTETETT ESZKÖZÖK"},{"$f":"IF(B2=\"\",\"\",IF(beallitasok!$B$6=\"\",\"\",beallitasok!$B$6))","v":"NYITÓ"},{"$f":"IF(B2=\"\",\"\",ROUND(ZARO_FOKONYV!C2+ZARO_FOKONYV!D2,0))","v":61563416},{"$f":"IF(B2=\"\",\"\",LEFT(IF(ZARO_FOKONYV!C2>0,IFERROR(VLOOKUP(ZARO_FOKONYV!$A2,FKCSERE!$A:$B,2,FALSE),ZARO_FOKONYV!$A2),beallitasok!$B$3)&\"00000\",6))","v":"100000"},{"$f":"IF(B2=\"\",\"\",LEFT(IF(ZARO_FOKONYV!D2>0,IFERROR(VLOOKUP(ZARO_FOKONYV!$A2,FKCSERE!$A:$B,2,FALSE),ZARO_FOKONYV!$A2),beallitasok!$B$3)&\"000000\",6))","v":"491000"},null,{"$f":"IF(LEFT(E2,3)=LEFT(beallitasok!$B$3,3),\"\",$B2)","v":"BEFEKTETETT ESZKÖZÖK"},{"$f":"IF(LEFT(F2,3)=LEFT(beallitasok!$B$3,3),\"\",$B2)","v":""},{"$f":"IF(AND(LEN(ZARO_FOKONYV!A2)<LEN(ZARO_FOKONYV!A3),LEFT(ZARO_FOKONYV!A3,LEN(ZARO_FOKONYV!A2))=ZARO_FOKONYV!A2),\"IGEN\",\"nem\")","v":"IGEN"}]
[{"$f":"IFERROR(IF(OR(AND(beallitasok!$H$5=\"IGEN\",J3=\"IGEN\"),B3=\"\",VALUE(LEFT(F3,LEN(beallitasok!$H$2)))=beallitasok!$H$2,VALUE(LEFT(E3,LEN(beallitasok!$H$3)))=beallitasok!$H$3,VALUE(LEFT(F3,LEN(beallitasok!$H$2)))=beallitasok!$H$3,VALUE(LEFT(E3,LEN(beallitasok!$H$3)))=beallitasok!$H$2),\"\",IF(D3=\"\",\"\",beallitasok!$B$2)),\"\")","v":""},{"$f":"IF(VALUE(LEFT(ZARO_FOKONYV!A3,1))<=beallitasok!$H$8,ZARO_FOKONYV!B3,\"\")","v":"IMMATERIÁLIS JAVAK"},{"$f":"IF(B3=\"\",\"\",IF(beallitasok!$B$6=\"\",\"\",beallitasok!$B$6))","v":"NYITÓ"},{"$f":"IF(B3=\"\",\"\",ROUND(ZARO_FOKONYV!C3+ZARO_FOKONYV!D3,0))","v":0},{"$f":"IF(B3=\"\",\"\",LEFT(IF(ZARO_FOKONYV!C3>0,IFERROR(VLOOKUP(ZARO_FOKONYV!$A3,FKCSERE!$A:$B,2,FALSE),ZARO_FOKONYV!$A3),beallitasok!$B$3)&\"00000\",6))","v":"491000"},{"$f":"IF(B3=\"\",\"\",LEFT(IF(ZARO_FOKONYV!D3>0,IFERROR(VLOOKUP(ZARO_FOKONYV!$A3,FKCSERE!$A:$B,2,FALSE),ZARO_FOKONYV!$A3),beallitasok!$B$3)&\"000000\",6))","v":"491000"},null,{"$f":"IF(LEFT(E3,3)=LEFT(beallitasok!$B$3,3),\"\",$B3)","v":""},{"$f":"IF(LEFT(F3,3)=LEFT(beallitasok!$B$3,3),\"\",$B3)","v":""},{"$f":"IF(AND(LEN(ZARO_FOKONYV!A3)<LEN(ZARO_FOKONYV!A4),LEFT(ZARO_FOKONYV!A4,LEN(ZARO_FOKONYV!A3))=ZARO_FOKONYV!A3),\"IGEN\",\"nem\")","v":"IGEN"}]
[{"$f":"IFERROR(IF(OR(AND(beallitasok!$H$5=\"IGEN\",J4=\"IGEN\"),B4=\"\",VALUE(LEFT(F4,LEN(beallitasok!$H$2)))=beallitasok!$H$2,VALUE(LEFT(E4,LEN(beallitasok!$H$3)))=beallitasok!$H$3,VALUE(LEFT(F4,LEN(beallitasok!$H$2)))=beallitasok!$H$3,VALUE(LEFT(E4,LEN(beallitasok!$H$3)))=beallitasok!$H$2),\"\",IF(D4=\"\",\"\",beallitasok!$B$2)),\"\")","v":"2020-12-31"},{"$f":"IF(VALUE(LEFT(ZARO_FOKONYV!A4,1))<=beallitasok!$H$8,ZARO_FOKONYV!B4,\"\")","v":"Vagyoni értékű jogok"},{"$f":"IF(B4=\"\",\"\",IF(beallitasok!$B$6=\"\",\"\",beallitasok!$B$6))","v":"NYITÓ"},{"$f":"IF(B4=\"\",\"\",ROUND(ZARO_FOKONYV!C4+ZARO_FOKONYV!D4,0))","v":78737},{"$f":"IF(B4=\"\",\"\",LEFT(IF(ZARO_FOKONYV!C4>0,IFERROR(VLOOKUP(ZARO_FOKONYV!$A4,FKCSERE!$A:$B,2,FALSE),ZARO_FOKONYV!$A4),beallitasok!$B$3)&\"00000\",6))","v":"113000"},{"$f":"IF(B4=\"\",\"\",LEFT(IF(ZARO_FOKONYV!D4>0,IFERROR(VLOOKUP(ZARO_FOKONYV!$A4,FKCSERE!$A:$B,2,FALSE),ZARO_FOKONYV!$A4),beallitasok!$B$3)&\"000000\",6))","v":"491000"},null,{"$f":"IF(LEFT(E4,3)=LEFT(beallitasok!$B$3,3),\"\",$B4)","v":"Vagyoni értékű jogok"},{"$f":"IF(LEFT(F4,3)=LEFT(beallitasok!$B$3,3),\"\",$B4)","v":""},{"$f":"IF(AND(LEN(ZARO_FOKONYV!A4)<LEN(ZARO_FOKONYV!A5),LEFT(ZARO_FOKONYV!A5,LEN(ZARO_FOKONYV!A4))=ZARO_FOKONYV!A4),\"IGEN\",\"nem\")","v":"nem"}]
[{"$f":"IFERROR(IF(OR(AND(beallitasok!$H$5=\"IGEN\",J5=\"IGEN\"),B5=\"\",VALUE(LEFT(F5,LEN(beallitasok!$H$2)))=beallitasok!$H$2,VALUE(LEFT(E5,LEN(beallitasok!$H$3)))=beallitasok!$H$3,VALUE(LEFT(F5,LEN(beallitasok!$H$2)))=beallitasok!$H$3,VALUE(LEFT(E5,LEN(beallitasok!$H$3)))=beallitasok!$H$2),\"\",IF(D5=\"\",\"\",beallitasok!$B$2)),\"\")","v":"2020-12-31"},{"$f":"IF(VALUE(LEFT(ZARO_FOKONYV!A5,1))<=beallitasok!$H$8,ZARO_FOKONYV!B5,\"\")","v":"Szellemi termékek"},{"$f":"IF(B5=\"\",\"\",IF(beallitasok!$B$6=\"\",\"\",beallitasok!$B$6))","v":"NYITÓ"},{"$f":"IF(B5=\"\",\"\",ROUND(ZARO_FOKONYV!C5+ZARO_FOKONYV!D5,0))","v":21000},{"$f":"IF(B5=\"\",\"\",LEFT(IF(ZARO_FOKONYV!C5>0,IFERROR(VLOOKUP(ZARO_FOKONYV!$A5,FKCSERE!$A:$B,2,FALSE),ZARO_FOKONYV!$A5),beallitasok!$B$3)&\"00000\",6))","v":"114000"},{"$f":"IF(B5=\"\",\"\",LEFT(IF(ZARO_FOKONYV!D5>0,IFERROR(VLOOKUP(ZARO_FOKONYV!$A5,FKCSERE!$A:$B,2,FALSE),ZARO_FOKONYV!$A5),beallitasok!$B$3)&\"000000\",6))","v":"491000"},null,{"$f":"IF(LEFT(E5,3)=LEFT(beallitasok!$B$3,3),\"\",$B5)","v":"Szellemi termékek"},{"$f":"IF(LEFT(F5,3)=LEFT(beallitasok!$B$3,3),\"\",$B5)","v":""},{"$f":"IF(AND(LEN(ZARO_FOKONYV!A5)<LEN(ZARO_FOKONYV!A6),LEFT(ZARO_FOKONYV!A6,LEN(ZARO_FOKONYV!A5))=ZARO_FOKONYV!A5),\"IGEN\",\"nem\")","v":"nem"}]
[{"$f":"IFERROR(IF(OR(AND(beallitasok!$H$5=\"IGEN\",J6=\"IGEN\"),B6=\"\",VALUE(LEFT(F6,LEN(beallitasok!$H$2)))=beallitasok!$H$2,VALUE(LEFT(E6,LEN(beallitasok!$H$3)))=beallitasok!$H$3,VALUE(LEFT(F6,LEN(beallitasok!$H$2)))=beallitasok!$H$3,VALUE(LEFT(E6,LEN(beallitasok!$H$3)))=beallitasok!$H$2),\"\",IF(D6=\"\",\"\",beallitasok!$B$2)),\"\")","v":"2020-12-31"},{"$f":"IF(VALUE(LEFT(ZARO_FOKONYV!A6,1))<=beallitasok!$H$8,ZARO_FOKONYV!B6,\"\")","v":"Immateriális javak terv szerinti értékcsökkenése"},{"$f":"IF(B6=\"\",\"\",IF(beallitasok!$B$6=\"\",\"\",beallitasok!$B$6))","v":"NYITÓ"},{"$f":"IF(B6=\"\",\"\",ROUND(ZARO_FOKONYV!C6+ZARO_FOKONYV!D6,0))","v":99737},{"$f":"IF(B6=\"\",\"\",LEFT(IF(ZARO_FOKONYV!C6>0,IFERROR(VLOOKUP(ZARO_FOKONYV!$A6,FKCSERE!$A:$B,2,FALSE),ZARO_FOKONYV!$A6),beallitasok!$B$3)&\"00000\",6))","v":"491000"},{"$f":"IF(B6=\"\",\"\",LEFT(IF(ZARO_FOKONYV!D6>0,IFERROR(VLOOKUP(ZARO_FOKONYV!$A6,FKCSERE!$A:$B,2,FALSE),ZARO_FOKONYV!$A6),beallitasok!$B$3)&\"000000\",6))","v":"119000"},null,{"$f":"IF(LEFT(E6,3)=LEFT(beallitasok!$B$3,3),\"\",$B6)","v":""},{"$f":"IF(LEFT(F6,3)=LEFT(beallitasok!$B$3,3),\"\",$B6)","v":"Immateriális javak terv szerinti értékcsökkenése"},{"$f":"IF(AND(LEN(ZARO_FOKONYV!A6)<LEN(ZARO_FOKONYV!A7),LEFT(ZARO_FOKONYV!A7,LEN(ZARO_FOKONYV!A6))=ZARO_FOKONYV!A6),\"IGEN\",\"nem\")","v":"nem"}]
[{"$f":"IFERROR(IF(OR(AND(beallitasok!$H$5=\"IGEN\",J7=\"IGEN\"),B7=\"\",VALUE(LEFT(F7,LEN(beallitasok!$H$2)))=beallitasok!$H$2,VALUE(LEFT(E7,LEN(beallitasok!$H$3)))=beallitasok!$H$3,VALUE(LEFT(F7,LEN(beallitasok!$H$2)))=beallitasok!$H$3,VALUE(LEFT(E7,LEN(beallitasok!$H$3)))=beallitasok!$H$2),\"\",IF(D7=\"\",\"\",beallitasok!$B$2)),\"\")","v":""},{"$f":"IF(VALUE(LEFT(ZARO_FOKONYV!A7,1))<=beallitasok!$H$8,ZARO_FOKONYV!B7,\"\")","v":"INGATLANOK ÉS KAPCSOLÓDÓ VAGYONI ÉRTÉKŰ JOGOK"},{"$f":"IF(B7=\"\",\"\",IF(beallitasok!$B$6=\"\",\"\",beallitasok!$B$6))","v":"NYITÓ"},{"$f":"IF(B7=\"\",\"\",ROUND(ZARO_FOKONYV!C7+ZARO_FOKONYV!D7,0))","v":49105108},{"$f":"IF(B7=\"\",\"\",LEFT(IF(ZARO_FOKONYV!C7>0,IFERROR(VLOOKUP(ZARO_FOKONYV!$A7,FKCSERE!$A:$B,2,FALSE),ZARO_FOKONYV!$A7),beallitasok!$B$3)&\"00000\",6))","v":"120000"},{"$f":"IF(B7=\"\",\"\",LEFT(IF(ZARO_FOKONYV!D7>0,IFERROR(VLOOKUP(ZARO_FOKONYV!$A7,FKCSERE!$A:$B,2,FALSE),ZARO_FOKONYV!$A7),beallitasok!$B$3)&\"000000\",6))","v":"491000"},null,{"$f":"IF(LEFT(E7,3)=LEFT(beallitasok!$B$3,3),\"\",$B7)","v":"INGATLANOK ÉS KAPCSOLÓDÓ VAGYONI ÉRTÉKŰ JOGOK"},{"$f":"IF(LEFT(F7,3)=LEFT(beallitasok!$B$3,3),\"\",$B7)","v":""},{"$f":"IF(AND(LEN(ZARO_FOKONYV!A7)<LEN(ZARO_FOKONYV!A8),LEFT(ZARO_FOKONYV!A8,LEN(ZARO_FOKONYV!A7))=ZARO_FOKONYV!A7),\"IGEN\",\"nem\")","v":"IGEN"}]
[{"$f":"IFERROR(IF(OR(AND(beallitasok!$H$5=\"IGEN\",J8=\"IGEN\"),B8=\"\",VALUE(LEFT(F8,LEN(beallitasok!$H$2)))=beallitasok!$H$2,VALUE(LEFT(E8,LEN(beallitasok!$H$3)))=beallitasok!$H$3,VALUE(LEFT(F8,LEN(beallitasok!$H$2)))=beallitasok!$H$3,VALUE(LEFT(E8,LEN(beallitasok!$H$3)))=beallitasok!$H$2),\"\",IF(D8=\"\",\"\",beallitasok!$B$2)),\"\")","v":"2020-12-31"},{"$f":"IF(VALUE(LEFT(ZARO_FOKONYV!A8,1))<=beallitasok!$H$8,ZARO_FOKONYV!B8,\"\")","v":"Épületek, épületrészek, tulajdoni hányadok"},{"$f":"IF(B8=\"\",\"\",IF(beallitasok!$B$6=\"\",\"\",beallitasok!$B$6))","v":"NYITÓ"},{"$f":"IF(B8=\"\",\"\",ROUND(ZARO_FOKONYV!C8+ZARO_FOKONYV!D8,0))","v":52000012},{"$f":"IF(B8=\"\",\"\",LEFT(IF(ZARO_FOKONYV!C8>0,IFERROR(VLOOKUP(ZARO_FOKONYV!$A8,FKCSERE!$A:$B,2,FALSE),ZARO_FOKONYV!$A8),beallitasok!$B$3)&\"00000\",6))","v":"123000"},{"$f":"IF(B8=\"\",\"\",LEFT(IF(ZARO_FOKONYV!D8>0,IFERROR(VLOOKUP(ZARO_FOKONYV!$A8,FKCSERE!$A:$B,2,FALSE),ZARO_FOKONYV!$A8),beallitasok!$B$3)&\"000000\",6))","v":"491000"},null,{"$f":"IF(LEFT(E8,3)=LEFT(beallitasok!$B$3,3),\"\",$B8)","v":"Épületek, épületrészek, tulajdoni hányadok"},{"$f":"IF(LEFT(F8,3)=LEFT(beallitasok!$B$3,3),\"\",$B8)","v":""},{"$f":"IF(AND(LEN(ZARO_FOKONYV!A8)<LEN(ZARO_FOKONYV!A9),LEFT(ZARO_FOKONYV!A9,LEN(ZARO_FOKONYV!A8))=ZARO_FOKONYV!A8),\"IGEN\",\"nem\")","v":"nem"}]
[{"$f":"IFERROR(IF(OR(AND(beallitasok!$H$5=\"IGEN\",J9=\"IGEN\"),B9=\"\",VALUE(LEFT(F9,LEN(beallitasok!$H$2)))=beallitasok!$H$2,VALUE(LEFT(E9,LEN(beallitasok!$H$3)))=beallitasok!$H$3,VALUE(LEFT(F9,LEN(beallitasok!$H$2)))=beallitasok!$H$3,VALUE(LEFT(E9,LEN(beallitasok!$H$3)))=beallitasok!$H$2),\"\",IF(D9=\"\",\"\",beallitasok!$B$2)),\"\")","v":"2020-12-31"},{"$f":"IF(VALUE(LEFT(ZARO_FOKONYV!A9,1))<=beallitasok!$H$8,ZARO_FOKONYV!B9,\"\")","v":"Ingatlanok terv szerinti értékcsökkenése"},{"$f":"IF(B9=\"\",\"\",IF(beallitasok!$B$6=\"\",\"\",beallitasok!$B$6))","v":"NYITÓ"},{"$f":"IF(B9=\"\",\"\",ROUND(ZARO_FOKONYV!C9+ZARO_FOKONYV!D9,0))","v":2894904},{"$f":"IF(B9=\"\",\"\",LEFT(IF(ZARO_FOKONYV!C9>0,IFERROR(VLOOKUP(ZARO_FOKONYV!$A9,FKCSERE!$A:$B,2,FALSE),ZARO_FOKONYV!$A9),beallitasok!$B$3)&\"00000\",6))","v":"491000"},{"$f":"IF(B9=\"\",\"\",LEFT(IF(ZARO_FOKONYV!D9>0,IFERROR(VLOOKUP(ZARO_FOKONYV!$A9,FKCSERE!$A:$B,2,FALSE),ZARO_FOKONYV!$A9),beallitasok!$B$3)&\"000000\",6))","v":"129000"},null,{"$f":"IF(LEFT(E9,3)=LEFT(beallitasok!$B$3,3),\"\",$B9)","v":""},{"$f":"IF(LEFT(F9,3)=LEFT(beallitasok!$B$3,3),\"\",$B9)","v":"Ingatlanok terv szerinti értékcsökkenése"},{"$f":"IF(AND(LEN(ZARO_FOKONYV!A9)<LEN(ZARO_FOKONYV!A10),LEFT(ZARO_FOKONYV!A10,LEN(ZARO_FOKONYV!A9))=ZARO_FOKONYV!A9),\"IGEN\",\"nem\")","v":"nem"}]
[{"$f":"IFERROR(IF(OR(AND(beallitasok!$H$5=\"IGEN\",J10=\"IGEN\"),B10=\"\",VALUE(LEFT(F10,LEN(beallitasok!$H$2)))=beallitasok!$H$2,VALUE(LEFT(E10,LEN(beallitasok!$H$3)))=beallitasok!$H$3,VALUE(LEFT(F10,LEN(beallitasok!$H$2)))=beallitasok!$H$3,VALUE(LEFT(E10,LEN(beallitasok!$H$3)))=beallitasok!$H$2),\"\",IF(D10=\"\",\"\",beallitasok!$B$2)),\"\")","v":""},{"$f":"IF(VALUE(LEFT(ZARO_FOKONYV!A10,1))<=beallitasok!$H$8,ZARO_FOKONYV!B10,\"\")","v":"EGYÉB BERENDEZÉSEK, FELSZERELÉSEK, GÉPEK, JÁRMŰVEK"},{"$f":"IF(B10=\"\",\"\",IF(beallitasok!$B$6=\"\",\"\",beallitasok!$B$6))","v":"NYITÓ"},{"$f":"IF(B10=\"\",\"\",ROUND(ZARO_FOKONYV!C10+ZARO_FOKONYV!D10,0))","v":8907049},{"$f":"IF(B10=\"\",\"\",LEFT(IF(ZARO_FOKONYV!C10>0,IFERROR(VLOOKUP(ZARO_FOKONYV!$A10,FKCSERE!$A:$B,2,FALSE),ZARO_FOKONYV!$A10),beallitasok!$B$3)&\"00000\",6))","v":"140000"},{"$f":"IF(B10=\"\",\"\",LEFT(IF(ZARO_FOKONYV!D10>0,IFERROR(VLOOKUP(ZARO_FOKONYV!$A10,FKCSERE!$A:$B,2,FALSE),ZARO_FOKONYV!$A10),beallitasok!$B$3)&\"000000\",6))","v":"491000"},null,{"$f":"IF(LEFT(E10,3)=LEFT(beallitasok!$B$3,3),\"\",$B10)","v":"EGYÉB BERENDEZÉSEK, FELSZERELÉSEK, GÉPEK, JÁRMŰVEK"},{"$f":"IF(LEFT(F10,3)=LEFT(beallitasok!$B$3,3),\"\",$B10)","v":""},{"$f":"IF(AND(LEN(ZARO_FOKONYV!A10)<LEN(ZARO_FOKONYV!A11),LEFT(ZARO_FOKONYV!A11,LEN(ZARO_FOKONYV!A10))=ZARO_FOKONYV!A10),\"IGEN\",\"nem\")","v":"IGEN"}]
[{"$f":"IFERROR(IF(OR(AND(beallitasok!$H$5=\"IGEN\",J11=\"IGEN\"),B11=\"\",VALUE(LEFT(F11,LEN(beallitasok!$H$2)))=beallitasok!$H$2,VALUE(LEFT(E11,LEN(beallitasok!$H$3)))=beallitasok!$H$3,VALUE(LEFT(F11,LEN(beallitasok!$H$2)))=beallitasok!$H$3,VALUE(LEFT(E11,LEN(beallitasok!$H$3)))=beallitasok!$H$2),\"\",IF(D11=\"\",\"\",beallitasok!$B$2)),\"\")","v":"2020-12-31"},{"$f":"IF(VALUE(LEFT(ZARO_FOKONYV!A11,1))<=beallitasok!$H$8,ZARO_FOKONYV!B11,\"\")","v":"Üzemi berend.tárgyak"},{"$f":"IF(B11=\"\",\"\",IF(beallitasok!$B$6=\"\",\"\",beallitasok!$B$6))","v":"NYITÓ"},{"$f":"IF(B11=\"\",\"\",ROUND(ZARO_FOKONYV!C11+ZARO_FOKONYV!D11,0))","v":5834040},{"$f":"IF(B11=\"\",\"\",LEFT(IF(ZARO_FOKONYV!C11>0,IFERROR(VLOOKUP(ZARO_FOKONYV!$A11,FKCSERE!$A:$B,2,FALSE),ZARO_FOKONYV!$A11),beallitasok!$B$3)&\"00000\",6))","v":"141100"},{"$f":"IF(B11=\"\",\"\",LEFT(IF(ZARO_FOKONYV!D11>0,IFERROR(VLOOKUP(ZARO_FOKONYV!$A11,FKCSERE!$A:$B,2,FALSE),ZARO_FOKONYV!$A11),beallitasok!$B$3)&\"000000\",6))","v":"491000"},null,{"$f":"IF(LEFT(E11,3)=LEFT(beallitasok!$B$3,3),\"\",$B11)","v":"Üzemi berend.tárgyak"},{"$f":"IF(LEFT(F11,3)=LEFT(beallitasok!$B$3,3),\"\",$B11)","v":""},{"$f":"IF(AND(LEN(ZARO_FOKONYV!A11)<LEN(ZARO_FOKONYV!A12),LEFT(ZARO_FOKONYV!A12,LEN(ZARO_FOKONYV!A11))=ZARO_FOKONYV!A11),\"IGEN\",\"nem\")","v":"nem"}]
[{"$f":"IFERROR(IF(OR(AND(beallitasok!$H$5=\"IGEN\",J12=\"IGEN\"),B12=\"\",VALUE(LEFT(F12,LEN(beallitasok!$H$2)))=beallitasok!$H$2,VALUE(LEFT(E12,LEN(beallitasok!$H$3)))=beallitasok!$H$3,VALUE(LEFT(F12,LEN(beallitasok!$H$2)))=beallitasok!$H$3,VALUE(LEFT(E12,LEN(beallitasok!$H$3)))=beallitasok!$H$2),\"\",IF(D12=\"\",\"\",beallitasok!$B$2)),\"\")","v":"2020-12-31"},{"$f":"IF(VALUE(LEFT(ZARO_FOKONYV!A12,1))<=beallitasok!$H$8,ZARO_FOKONYV!B12,\"\")","v":"Egyéb járművek"},{"$f":"IF(B12=\"\",\"\",IF(beallitasok!$B$6=\"\",\"\",beallitasok!$B$6))","v":"NYITÓ"},{"$f":"IF(B12=\"\",\"\",ROUND(ZARO_FOKONYV!C12+ZARO_FOKONYV!D12,0))","v":12820711},{"$f":"IF(B12=\"\",\"\",LEFT(IF(ZARO_FOKONYV!C12>0,IFERROR(VLOOKUP(ZARO_FOKONYV!$A12,FKCSERE!$A:$B,2,FALSE),ZARO_FOKONYV!$A12),beallitasok!$B$3)&\"00000\",6))","v":"142000"},{"$f":"IF(B12=\"\",\"\",LEFT(IF(ZARO_FOKONYV!D12>0,IFERROR(VLOOKUP(ZARO_FOKONYV!$A12,FKCSERE!$A:$B,2,FALSE),ZARO_FOKONYV!$A12),beallitasok!$B$3)&\"000000\",6))","v":"491000"},null,{"$f":"IF(LEFT(E12,3)=LEFT(beallitasok!$B$3,3),\"\",$B12)","v":"Egyéb járművek"},{"$f":"IF(LEFT(F12,3)=LEFT(beallitasok!$B$3,3),\"\",$B12)","v":""},{"$f":"IF(AND(LEN(ZARO_FOKONYV!A12)<LEN(ZARO_FOKONYV!A13),LEFT(ZARO_FOKONYV!A13,LEN(ZARO_FOKONYV!A12))=ZARO_FOKONYV!A12),\"IGEN\",\"nem\")","v":"nem"}]
[{"$f":"IFERROR(IF(OR(AND(beallitasok!$H$5=\"IGEN\",J13=\"IGEN\"),B13=\"\",VALUE(LEFT(F13,LEN(beallitasok!$H$2)))=beallitasok!$H$2,VALUE(LEFT(E13,LEN(beallitasok!$H$3)))=beallitasok!$H$3,VALUE(LEFT(F13,LEN(beallitasok!$H$2)))=beallitasok!$H$3,VALUE(LEFT(E13,LEN(beallitasok!$H$3)))=beallitasok!$H$2),\"\",IF(D13=\"\",\"\",beallitasok!$B$2)),\"\")","v":""},{"$f":"IF(VALUE(LEFT(ZARO_FOKONYV!A13,1))<=beallitasok!$H$8,ZARO_FOKONYV!B13,\"\")","v":"Irodai, igazgatási berendezések és felszerelések"},{"$f":"IF(B13=\"\",\"\",IF(beallitasok!$B$6=\"\",\"\",beallitasok!$B$6))","v":"NYITÓ"},{"$f":"IF(B13=\"\",\"\",ROUND(ZARO_FOKONYV!C13+ZARO_FOKONYV!D13,0))","v":3460124},{"$f":"IF(B13=\"\",\"\",LEFT(IF(ZARO_FOKONYV!C13>0,IFERROR(VLOOKUP(ZARO_FOKONYV!$A13,FKCSERE!$A:$B,2,FALSE),ZARO_FOKONYV!$A13),beallitasok!$B$3)&\"00000\",6))","v":"143000"},{"$f":"IF(B13=\"\",\"\",LEFT(IF(ZARO_FOKONYV!D13>0,IFERROR(VLOOKUP(ZARO_FOKONYV!$A13,FKCSERE!$A:$B,2,FALSE),ZARO_FOKONYV!$A13),beallitasok!$B$3)&\"000000\",6))","v":"491000"},null,{"$f":"IF(LEFT(E13,3)=LEFT(beallitasok!$B$3,3),\"\",$B13)","v":"Irodai, igazgatási berendezések és felszerelések"},{"$f":"IF(LEFT(F13,3)=LEFT(beallitasok!$B$3,3),\"\",$B13)","v":""},{"$f":"IF(AND(LEN(ZARO_FOKONYV!A13)<LEN(ZARO_FOKONYV!A14),LEFT(ZARO_FOKONYV!A14,LEN(ZARO_FOKONYV!A13))=ZARO_FOKONYV!A13),\"IGEN\",\"nem\")","v":"IGEN"}]
[{"$f":"IFERROR(IF(OR(AND(beallitasok!$H$5=\"IGEN\",J14=\"IGEN\"),B14=\"\",VALUE(LEFT(F14,LEN(beallitasok!$H$2)))=beallitasok!$H$2,VALUE(LEFT(E14,LEN(beallitasok!$H$3)))=beallitasok!$H$3,VALUE(LEFT(F14,LEN(beallitasok!$H$2)))=beallitasok!$H$3,VALUE(LEFT(E14,LEN(beallitasok!$H$3)))=beallitasok!$H$2),\"\",IF(D14=\"\",\"\",beallitasok!$B$2)),\"\")","v":"2020-12-31"},{"$f":"IF(VALUE(LEFT(ZARO_FOKONYV!A14,1))<=beallitasok!$H$8,ZARO_FOKONYV!B14,\"\")","v":"Adatrögzítő készölékek"},{"$f":"IF(B14=\"\",\"\",IF(beallitasok!$B$6=\"\",\"\",beallitasok!$B$6))","v":"NYITÓ"},{"$f":"IF(B14=\"\",\"\",ROUND(ZARO_FOKONYV!C14+ZARO_FOKONYV!D14,0))","v":5820273},{"$f":"IF(B14=\"\",\"\",LEFT(IF(ZARO_FOKONYV!C14>0,IFERROR(VLOOKUP(ZARO_FOKONYV!$A14,FKCSERE!$A:$B,2,FALSE),ZARO_FOKONYV!$A14),beallitasok!$B$3)&\"00000\",6))","v":"143100"},{"$f":"IF(B14=\"\",\"\",LEFT(IF(ZARO_FOKONYV!D14>0,IFERROR(VLOOKUP(ZARO_FOKONYV!$A14,FKCSERE!$A:$B,2,FALSE),ZARO_FOKONYV!$A14),beallitasok!$B$3)&\"000000\",6))","v":"491000"},null,{"$f":"IF(LEFT(E14,3)=LEFT(beallitasok!$B$3,3),\"\",$B14)","v":"Adatrögzítő készölékek"},{"$f":"IF(LEFT(F14,3)=LEFT(beallitasok!$B$3,3),\"\",$B14)","v":""},{"$f":"IF(AND(LEN(ZARO_FOKONYV!A14)<LEN(ZARO_FOKONYV!A15),LEFT(ZARO_FOKONYV!A15,LEN(ZARO_FOKONYV!A14))=ZARO_FOKONYV!A14),\"IGEN\",\"nem\")","v":"nem"}]
[{"$f":"IFERROR(IF(OR(AND(beallitasok!$H$5=\"IGEN\",J15=\"IGEN\"),B15=\"\",VALUE(LEFT(F15,LEN(beallitasok!$H$2)))=beallitasok!$H$2,VALUE(LEFT(E15,LEN(beallitasok!$H$3)))=beallitasok!$H$3,VALUE(LEFT(F15,LEN(beallitasok!$H$2)))=beallitasok!$H$3,VALUE(LEFT(E15,LEN(beallitasok!$H$3)))=beallitasok!$H$2),\"\",IF(D15=\"\",\"\",beallitasok!$B$2)),\"\")","v":"2020-12-31"},{"$f":"IF(VALUE(LEFT(ZARO_FOKONYV!A15,1))<=beallitasok!$H$8,ZARO_FOKONYV!B15,\"\")","v":"Üzemkörön kívüli berendezése, felszerelések, járművek"},{"$f":"IF(B15=\"\",\"\",IF(beallitasok!$B$6=\"\",\"\",beallitasok!$B$6))","v":"NYITÓ"},{"$f":"IF(B15=\"\",\"\",ROUND(ZARO_FOKONYV!C15+ZARO_FOKONYV!D15,0))","v":169900},{"$f":"IF(B15=\"\",\"\",LEFT(IF(ZARO_FOKONYV!C15>0,IFERROR(VLOOKUP(ZARO_FOKONYV!$A15,FKCSERE!$A:$B,2,FALSE),ZARO_FOKONYV!$A15),beallitasok!$B$3)&\"00000\",6))","v":"144000"},{"$f":"IF(B15=\"\",\"\",LEFT(IF(ZARO_FOKONYV!D15>0,IFERROR(VLOOKUP(ZARO_FOKONYV!$A15,FKCSERE!$A:$B,2,FALSE),ZARO_FOKONYV!$A15),beallitasok!$B$3)&\"000000\",6))","v":"491000"},null,{"$f":"IF(LEFT(E15,3)=LEFT(beallitasok!$B$3,3),\"\",$B15)","v":"Üzemkörön kívüli berendezése, felszerelések, járművek"},{"$f":"IF(LEFT(F15,3)=LEFT(beallitasok!$B$3,3),\"\",$B15)","v":""},{"$f":"IF(AND(LEN(ZARO_FOKONYV!A15)<LEN(ZARO_FOKONYV!A16),LEFT(ZARO_FOKONYV!A16,LEN(ZARO_FOKONYV!A15))=ZARO_FOKONYV!A15),\"IGEN\",\"nem\")","v":"nem"}]
{"$rows_left_out":148}
{"sheet":"FKCSERE","index":3,"n_rows":2,"n_cols":2,"rows_kept":2,"cut":false,"hidden":false,"merged":[]}
["RÉGI PROGI","RELAX"]
[353,354]